{"text_format":"3","workbook":"xlsx","n_sheets":11,"sheets":["Buchung","Daten","Anordnung","Formular","Steuerkennzeichen","Seite 2","xRechnung","Rechtsformen","Länder","Kontierungsobjekte","Maßeinheiten"],"not_rendered":{"images":1,"external_links":1,"defined_names":79,"comments":1},"read":"whole","date_system":"1900"}

{"sheet":"Buchung","index":0,"n_rows":19,"n_cols":34,"rows_kept":19,"hidden":true}
["Belegnummer","Beleg-ID der Kopfdaten","Buchungskreis","Belegart","Belegdatum","Buchungsdatum","Buchungsperiode","Referenz","Belegkopftext","Position","Hauptbuchkonto","Text","Zuordnung","Zahlweg","Steuerkennzeichen","Soll/Haben-Kennz.","Betrag Hauswähr","Steuer Hauswährung","Geschäftsbereich","Kostenstelle","Auftrag","PSP-Element","Fonds","Kreditor","Debitor","Kontoart","Name 1","Name 2","Straße","Postleitzahl","Ort","Land","IBAN","SWIFT/BIC"]
[{"$f":"IF(OR($Q2=0,$Q2=\"\"),\"nicht buchen\",\"\")","v":"nicht buchen"},1,"1000",{"$f":"IF($P$2=\"H\",\"DG\",\"DR\")","v":"DR"},{"$f":"Formular!$G$36","v":"2024-08-27"},{"$f":"E2","v":"2024-08-27"},{"$f":"MONTH(F2)","v":8},{"$f":"MID(YEAR(Formular!$G$36),3,2)&IF(LEN(Formular!$W$38)=7,\"000\",\"\")&Formular!$W$38&CHOOSE(LEN(Formular!$AF$38),\"000\",\"00\",\"0\",\"\")&Formular!$AF$38","v":"2400035005100000"},"Ausgangsrechnung","1",null,{"$f":"\"*\"&MID(Daten!$E$89,1,45)","v":"*"},{"$f":"IF(Daten!$X$65=\"\",H2,CHOOSE(Daten!$V$65,\"PSP \"&Daten!$E$65,\"KST \"&Daten!$E$65,\"IA \"&Daten!$E$65))","v":"2400035005100000"},null,null,{"$f":"IF((SUMIF(P3:P9,\"H\",Q3:S9)-SUMIF(P3:P9,\"S\",Q3:S9))<0,\"H\",\"S\")","v":"S"},{"$f":"MAX(Formular!$AE$72,-Formular!$AE$72)","v":0},{"$nulls":7},{"$f":"Formular!$F$20","v":""},"D",{"$f":"IF(AND(Daten!$V$16=2,$Y2=\"602326\"),Daten!$E$18,\"\")","v":""},{"$f":"IF(AND(Daten!$V$16=2,$Y2=\"602326\"),Daten!$E$19,\"\")","v":""},{"$f":"IF(AND(Daten!$V$16=2,$Y2=\"602326\"),Daten!$E$25&\" \"&Daten!$L$25,\"\")","v":""},{"$f":"IF(AND(Daten!$V$16=2,$Y2=\"602326\"),Daten!$E$27,\"\")","v":""},{"$f":"IF(AND(Daten!$V$16=2,$Y2=\"602326\"),Daten!$H$27,\"\")","v":""},{"$f":"IF(AND(Daten!$V$16=2,$Y2=\"602326\"),Daten!$N$29,\"\")","v":""}]
["nicht buchen",1,"1000",{"$f":"$D2","v":"DR"},{"$f":"E2","v":"2024-08-27"},{"$f":"F2","v":"2024-08-27"},{"$f":"MONTH(F3)","v":8},{"$f":"H2","v":"2400035005100000"},"Ausgangsrechnung",2,{"$f":"Formular!$F$21","v":0},{"$f":"IF(Anordnung!$C$41=\"\",\"\",Anordnung!$C$41)&VLOOKUP($J3-1,Daten!$E$95:$R$114,2,FALSE)","v":""},{"$f":"IF(Daten!$X$65=\"\",H3,CHOOSE(Daten!$V$65,\"PSP \"&Daten!$E$65,\"KST \"&Daten!$E$65,\"IA \"&Daten!$E$65))","v":"2400035005100000"},null,{"$f":"IF(ISNA(VLOOKUP($J3-1,Formular!$B$50:$AJ$69,35,FALSE)),\"\",IF(AND(Daten!$V$16=2,Daten!$V$65=1,MID(Daten!$E$38,1,1)=\"1\",MID(Daten!$E$65,1,1)=\"1\"),\"AI\",CHOOSE(VLOOKUP($J3-1,Formular!$B$50:$AJ$69,35,FALSE),Formular!$A$11,Formular!$A$12,Formular!$A$13,Formular!$A$14,Formular!$A$15,Formular!$A$16,Formular!$A$17,Formular!$A$18)))","v":""},{"$f":"IF(VLOOKUP($J3-1,Daten!$E$95:$R$114,14,FALSE)<0,\"S\",\"H\")","v":"H"},{"$f":"ROUND(MAX(VLOOKUP($J3-1,Daten!$E$95:$R$114,14,FALSE),-VLOOKUP($J3-1,Daten!$E$95:$R$114,14,FALSE))/IF(OR(Daten!$X$96=\"X\",$O3=\"\"),1,1+IF(MID($O3,2,1)=\"1\",19%,IF(MID($O3,2,1)=\"2\",7%,IF(MID($O3,2,1)=\"E\",16%,IF(MID($O3,2,1)=\"Z\",5%,0%))))),2)","v":0},{"$f":"ROUND(IF(MID($O3,2,1)=\"1\",$Q3*0.19,IF(MID($O3,2,1)=\"2\",$Q3*0.07,IF(MID($O3,2,1)=\"E\",$Q3*0.16,IF(MID($O3,2,1)=\"Z\",$Q3*0.05,0)))),2)","v":0},null,{"$f":"IF(Daten!$X$65=\"\",CHOOSE(Daten!$V$65,\"\",Daten!$E$65,\"\"),\"\")","v":""},{"$f":"IF(Daten!$X$65=\"\",CHOOSE(Daten!$V$65,\"\",\"\",Daten!$E$65),\"\")","v":""},{"$f":"IF(Daten!$X$65=\"\",CHOOSE(Daten!$V$65,Daten!$E$65,\"\",\"\"),Daten!$X$65)","v":0},{"$f":"IF(Daten!$X$65=\"\",CHOOSE(Daten!$V$65,\"\",Daten!$L$65,\"\"),\"\")","v":""},null,null,"S"]
["nicht buchen",1,"1000",{"$f":"$D2","v":"DR"},{"$f":"E2","v":"2024-08-27"},{"$f":"F2","v":"2024-08-27"},8,{"$f":"H2","v":"2400035005100000"},"Ausgangsrechnung",3,{"$f":"K3","v":0},{"$f":"IF(Anordnung!$C$41=\"\",\"\",Anordnung!$C$41)&VLOOKUP($J4-1,Daten!$E$95:$R$114,2,FALSE)","v":""},{"$f":"IF(Daten!$X$65=\"\",H4,CHOOSE(Daten!$V$65,\"PSP \"&Daten!$E$65,\"KST \"&Daten!$E$65,\"IA \"&Daten!$E$65))","v":"2400035005100000"},null,{"$f":"IF(ISNA(VLOOKUP($J4-1,Formular!$B$50:$AJ$69,35,FALSE)),\"\",IF(AND(Daten!$V$16=2,Daten!$V$65=1,MID(Daten!$E$38,1,1)=\"1\",MID(Daten!$E$65,1,1)=\"1\"),\"AI\",CHOOSE(VLOOKUP($J4-1,Formular!$B$50:$AJ$69,35,FALSE),Formular!$A$11,Formular!$A$12,Formular!$A$13,Formular!$A$14,Formular!$A$15,Formular!$A$16,Formular!$A$17,Formular!$A$18)))","v":""},{"$f":"IF(VLOOKUP($J4-1,Daten!$E$95:$R$114,14,FALSE)<0,\"S\",\"H\")","v":"H"},{"$f":"ROUND(MAX(VLOOKUP($J4-1,Daten!$E$95:$R$114,14,FALSE),-VLOOKUP($J4-1,Daten!$E$95:$R$114,14,FALSE))/IF(OR(Daten!$X$96=\"X\",$O4=\"\"),1,1+IF(MID($O4,2,1)=\"1\",19%,IF(MID($O4,2,1)=\"2\",7%,IF(MID($O4,2,1)=\"E\",16%,IF(MID($O4,2,1)=\"Z\",5%,0%))))),2)","v":0},{"$f":"ROUND(IF(MID($O4,2,1)=\"1\",$Q4*0.19,IF(MID($O4,2,1)=\"2\",$Q4*0.07,IF(MID($O4,2,1)=\"E\",$Q4*0.16,IF(MID($O4,2,1)=\"Z\",$Q4*0.05,0)))),2)","v":0},null,{"$f":"T3","v":""},{"$f":"U3","v":""},{"$f":"V3","v":0},{"$f":"W3","v":""},null,null,"S"]
["nicht buchen",1,"1000",{"$f":"$D2","v":"DR"},{"$f":"E2","v":"2024-08-27"},{"$f":"F2","v":"2024-08-27"},8,{"$f":"H2","v":"2400035005100000"},"Ausgangsrechnung",4,{"$f":"K3","v":0},{"$f":"IF(Anordnung!$C$41=\"\",\"\",Anordnung!$C$41)&VLOOKUP($J5-1,Daten!$E$95:$R$114,2,FALSE)","v":""},{"$f":"IF(Daten!$X$65=\"\",H5,CHOOSE(Daten!$V$65,\"PSP \"&Daten!$E$65,\"KST \"&Daten!$E$65,\"IA \"&Daten!$E$65))","v":"2400035005100000"},null,{"$f":"IF(ISNA(VLOOKUP($J5-1,Formular!$B$50:$AJ$69,35,FALSE)),\"\",IF(AND(Daten!$V$16=2,Daten!$V$65=1,MID(Daten!$E$38,1,1)=\"1\",MID(Daten!$E$65,1,1)=\"1\"),\"AI\",CHOOSE(VLOOKUP($J5-1,Formular!$B$50:$AJ$69,35,FALSE),Formular!$A$11,Formular!$A$12,Formular!$A$13,Formular!$A$14,Formular!$A$15,Formular!$A$16,Formular!$A$17,Formular!$A$18)))","v":""},{"$f":"IF(VLOOKUP($J5-1,Daten!$E$95:$R$114,14,FALSE)<0,\"S\",\"H\")","v":"H"},{"$f":"ROUND(MAX(VLOOKUP($J5-1,Daten!$E$95:$R$114,14,FALSE),-VLOOKUP($J5-1,Daten!$E$95:$R$114,14,FALSE))/IF(OR(Daten!$X$96=\"X\",$O5=\"\"),1,1+IF(MID($O5,2,1)=\"1\",19%,IF(MID($O5,2,1)=\"2\",7%,IF(MID($O5,2,1)=\"E\",16%,IF(MID($O5,2,1)=\"Z\",5%,0%))))),2)","v":0},0,null,{"$f":"T3","v":""},{"$f":"U3","v":""},{"$f":"V3","v":0},{"$f":"W3","v":""},null,null,"S"]
["nicht buchen",1,"1000",{"$f":"$D2","v":"DR"},{"$f":"E2","v":"2024-08-27"},{"$f":"F2","v":"2024-08-27"},8,{"$f":"H2","v":"2400035005100000"},"Ausgangsrechnung",5,{"$f":"K3","v":0},{"$f":"IF(Anordnung!$C$41=\"\",\"\",Anordnung!$C$41)&VLOOKUP($J6-1,Daten!$E$95:$R$114,2,FALSE)","v":""},{"$f":"IF(Daten!$X$65=\"\",H6,CHOOSE(Daten!$V$65,\"PSP \"&Daten!$E$65,\"KST \"&Daten!$E$65,\"IA \"&Daten!$E$65))","v":"2400035005100000"},null,{"$f":"IF(ISNA(VLOOKUP($J6-1,Formular!$B$50:$AJ$69,35,FALSE)),\"\",IF(AND(Daten!$V$16=2,Daten!$V$65=1,MID(Daten!$E$38,1,1)=\"1\",MID(Daten!$E$65,1,1)=\"1\"),\"AI\",CHOOSE(VLOOKUP($J6-1,Formular!$B$50:$AJ$69,35,FALSE),Formular!$A$11,Formular!$A$12,Formular!$A$13,Formular!$A$14,Formular!$A$15,Formular!$A$16,Formular!$A$17,Formular!$A$18)))","v":""},{"$f":"IF(VLOOKUP($J6-1,Daten!$E$95:$R$114,14,FALSE)<0,\"S\",\"H\")","v":"H"},{"$f":"ROUND(MAX(VLOOKUP($J6-1,Daten!$E$95:$R$114,14,FALSE),-VLOOKUP($J6-1,Daten!$E$95:$R$114,14,FALSE))/IF(OR(Daten!$X$96=\"X\",$O6=\"\"),1,1+IF(MID($O6,2,1)=\"1\",19%,IF(MID($O6,2,1)=\"2\",7%,IF(MID($O6,2,1)=\"E\",16%,IF(MID($O6,2,1)=\"Z\",5%,0%))))),2)","v":0},0,null,{"$f":"T3","v":""},{"$f":"U3","v":""},{"$f":"V3","v":0},{"$f":"W3","v":""},null,null,"S"]
["nicht buchen",1,"1000",{"$f":"$D2","v":"DR"},{"$f":"E2","v":"2024-08-27"},{"$f":"F2","v":"2024-08-27"},8,{"$f":"H2","v":"2400035005100000"},"Ausgangsrechnung",6,{"$f":"K3","v":0},{"$f":"IF(Anordnung!$C$41=\"\",\"\",Anordnung!$C$41)&VLOOKUP($J7-1,Daten!$E$95:$R$114,2,FALSE)","v":""},{"$f":"IF(Daten!$X$65=\"\",H7,CHOOSE(Daten!$V$65,\"PSP \"&Daten!$E$65,\"KST \"&Daten!$E$65,\"IA \"&Daten!$E$65))","v":"2400035005100000"},null,{"$f":"IF(ISNA(VLOOKUP($J7-1,Formular!$B$50:$AJ$69,35,FALSE)),\"\",IF(AND(Daten!$V$16=2,Daten!$V$65=1,MID(Daten!$E$38,1,1)=\"1\",MID(Daten!$E$65,1,1)=\"1\"),\"AI\",CHOOSE(VLOOKUP($J7-1,Formular!$B$50:$AJ$69,35,FALSE),Formular!$A$11,Formular!$A$12,Formular!$A$13,Formular!$A$14,Formular!$A$15,Formular!$A$16,Formular!$A$17,Formular!$A$18)))","v":""},{"$f":"IF(VLOOKUP($J7-1,Daten!$E$95:$R$114,14,FALSE)<0,\"S\",\"H\")","v":"H"},{"$f":"ROUND(MAX(VLOOKUP($J7-1,Daten!$E$95:$R$114,14,FALSE),-VLOOKUP($J7-1,Daten!$E$95:$R$114,14,FALSE))/IF(OR(Daten!$X$96=\"X\",$O7=\"\"),1,1+IF(MID($O7,2,1)=\"1\",19%,IF(MID($O7,2,1)=\"2\",7%,IF(MID($O7,2,1)=\"E\",16%,IF(MID($O7,2,1)=\"Z\",5%,0%))))),2)","v":0},0,null,{"$f":"T3","v":""},{"$f":"U3","v":""},{"$f":"V3","v":0},{"$f":"W3","v":""},null,null,"S"]
["nicht buchen",1,"1000",{"$f":"$D2","v":"DR"},{"$f":"E2","v":"2024-08-27"},"2024-08-27",8,{"$f":"H2","v":"2400035005100000"},"Ausgangsrechnung",7,{"$f":"K3","v":0},{"$f":"IF(Anordnung!$C$41=\"\",\"\",Anordnung!$C$41)&VLOOKUP($J8-1,Daten!$E$95:$R$114,2,FALSE)","v":""},{"$f":"IF(Daten!$X$65=\"\",H8,CHOOSE(Daten!$V$65,\"PSP \"&Daten!$E$65,\"KST \"&Daten!$E$65,\"IA \"&Daten!$E$65))","v":"2400035005100000"},null,{"$f":"IF(ISNA(VLOOKUP($J8-1,Formular!$B$50:$AJ$69,35,FALSE)),\"\",IF(AND(Daten!$V$16=2,Daten!$V$65=1,MID(Daten!$E$38,1,1)=\"1\",MID(Daten!$E$65,1,1)=\"1\"),\"AI\",CHOOSE(VLOOKUP($J8-1,Formular!$B$50:$AJ$69,35,FALSE),Formular!$A$11,Formular!$A$12,Formular!$A$13,Formular!$A$14,Formular!$A$15,Formular!$A$16,Formular!$A$17,Formular!$A$18)))","v":""},{"$f":"IF(VLOOKUP($J8-1,Daten!$E$95:$R$114,14,FALSE)<0,\"S\",\"H\")","v":"H"},{"$f":"ROUND(MAX(VLOOKUP($J8-1,Daten!$E$95:$R$114,14,FALSE),-VLOOKUP($J8-1,Daten!$E$95:$R$114,14,FALSE))/IF(OR(Daten!$X$96=\"X\",$O8=\"\"),1,1+IF(MID($O8,2,1)=\"1\",19%,IF(MID($O8,2,1)=\"2\",7%,IF(MID($O8,2,1)=\"E\",16%,IF(MID($O8,2,1)=\"Z\",5%,0%))))),2)","v":0},0,null,{"$f":"T3","v":""},"",0,"",null,null,"S"]
{"$rows_left_out":12}
{"sheet":"Daten","index":1,"n_rows":119,"n_cols":27,"rows_kept":119,"merged":[[0,5,2,19],[5,12,5,19],[17,4,17,11],[17,23,17,24],[18,4,18,11],[19,4,19,11],[20,4,20,11],[24,4,24,9],[26,4,26,5],[26,7,26,11],[28,14,28,16],[28,17,28,19],[30,4,30,11],[30,14,30,16],[30,17,30,19],[33,1,33,13],[33,14,33,16],[33,17,33,19],[35,4,35,5],[35,14,35,16],[35,17,35,19],[37,4,37,5],[37,14,37,16],[37,17,37,19],[42,4,42,7],[44,4,44,11],[45,4,45,11],[46,4,46,11],[47,4,47,11],[49,4,49,9],[51,4,51,5],[51,7,51,11],[55,4,55,9],[56,4,56,9],[58,4,58,11],[60,4,60,11],[62,4,62,11],[64,4,64,5],[64,23,64,24],[70,4,70,9],[70,13,72,19],[72,4,72,5],[72,7,72,11],[76,4,76,11],[78,9,78,11],[78,17,78,19],[80,9,80,11],[80,17,80,19],[82,4,82,11],[82,17,82,19],[86,4,86,5],[86,7,86,8],[88,4,88,19],[89,4,89,19],[90,4,90,19],[92,17,92,19],[94,5,94,15],[94,17,94,19],[95,5,95,6],[95,9,95,10],[95,14,95,15],[97,5,97,15],[97,17,97,19],[98,5,98,6],[98,9,98,10],[98,14,98,15],[100,5,100,15],[100,17,100,19],[101,5,101,6],[101,9,101,10],[101,14,101,15],[103,5,103,15],[103,17,103,19],[104,5,104,6],[104,9,104,10],[104,14,104,15],[106,5,106,15],[106,17,106,19],[107,5,107,6],[107,9,107,10],[107,14,107,15],[109,5,109,15],[109,17,109,19],[110,5,110,6],[110,9,110,10],[110,14,110,15],[112,5,112,15],[112,17,112,19],[113,5,113,6],[113,9,113,10],[113,14,113,15],[117,1,117,2],[117,4,117,19]]}
[{"$nulls":5},"Vorlage zur Erstellung von Rechnungen"]
[]
[]
[{"$nulls":7},"nur Kopie an VII 2",{"$f":"IF(AND(OR(AND(Kontierung_Art=1,OR(MID(Kontierung_Nr,1,1)=\"3\",MID(Kontierung_Nr,1,1)=\"4\")),MID($L$65,1,1)=\"2\",MID($L$65,1,1)=\"3\"),$O$4<>\"X\"),\"X\",\"\")","v":""},{"$nulls":4},"vorab zur Prüfung an VII 2",{"$f":"IF(OR(AND(Kontierung_Art=1,OR(MID(Kontierung_Nr,1,1)=\"3\",MID(Kontierung_Nr,1,1)=\"4\"),$U$4<>\"X\")),\"X\",\"\")","v":""},{"$nulls":4},"vorab zur Prüfung an VII 5",{"$f":"IF(AND(OR(AND(Kontierung_Art=1,MID(Kontierung_Nr,1,1)=\"1\",MID(Kontierung_Nr,3,2)<>\"52\"),AND(Kontierung_Art=1,MID(Kontierung_Nr,1,1)=\"2\"),AND(Kontierung_Art=1,MID(Kontierung_Nr,1,1)=\"5\"),AND(Kontierung_Art=1,MID(Kontierung_Nr,1,1)=\"3\"),AND(Kontierung_Art=1,MID(Kontierung_Nr,1,1)=\"4\"),AND(Kontierung_Art=2),$N$41<>\"DE\"),$V$16<>2),\"X\",\"\")","v":""}]
[]
[{"$nulls":11},"Bitte Kopie der Rechnung als PDF per Mail an:"]
[]
["Bitte folgende Hinweise unbedingt beachten:"]
{"$rows_left_out":112}
{"sheet":"Anordnung","index":2,"n_rows":53,"n_cols":39,"rows_kept":53,"merged":[[0,1,0,25],[1,2,1,8],[1,11,1,16],[2,3,2,8],[2,12,4,13],[2,15,4,16],[2,19,2,20],[2,22,2,24],[3,3,3,8],[4,3,4,8],[4,22,4,24],[5,3,5,8],[5,22,5,24],[7,2,7,8],[7,11,7,16],[7,18,7,25],[11,12,11,16],[11,18,11,25],[12,12,12,16],[15,2,15,8],[15,13,15,16],[17,2,17,8],[17,18,17,25],[19,2,19,8],[19,10,19,13],[19,14,19,16],[21,2,21,8],[21,10,21,16],[23,2,23,8],[23,10,23,16],[23,18,24,22],[23,23,24,24],[25,2,25,8],[25,11,25,16],[25,19,25,24],[26,2,26,8],[26,11,26,16],[26,19,26,24],[28,2,28,8],[28,9,28,24],[30,1,30,25],[31,2,31,8],[31,9,31,13],[32,9,32,13],[33,1,33,25],[35,2,35,4],[35,7,35,8],[35,11,35,16],[35,19,35,24],[36,2,36,4],[36,7,36,8],[36,11,36,16],[36,19,36,24],[37,2,37,4],[37,7,37,8],[37,11,37,16],[37,19,37,24],[38,2,38,25],[39,2,39,3],[40,2,40,3],[40,5,40,24],[42,2,42,25],[43,2,43,24],[44,2,44,24],[46,2,47,5],[46,6,47,15],[47,17,47,20],[47,22,47,24],[48,6,48,15],[48,17,48,20],[48,22,48,24],[49,17,49,20],[49,22,49,24],[50,17,50,20],[50,22,50,24],[51,2,51,5],[51,11,51,14],[51,17,51,20],[51,22,51,24],[52,17,52,20],[52,22,52,24]]}
[]
[null,1,"Absenderangaben",{"$nulls":7},2,"Vorgangsart (bitte ankreuzen)",{"$nulls":7},"G-Jahr",null,null,"Belegnummer"]
[null,"Bereich",null,{"$f":"IF(Daten!$E$56=0,\"\",Daten!$E$56)","v":""},{"$nulls":8},"A",null,null,"E"]
[null,"Name",null,{"$f":"IF(Daten!$E$77=0,\"\",Daten!$E$77)","v":""}]
[null,"Telefon",null,{"$f":"IF(Daten!$J$79=0,\"\",Daten!$E$79&Daten!$F$79&\" \"&IF(Daten!$H$79=0,\"\",Daten!$H$79&\"-\")&Daten!$J$79)","v":""},{"$nulls":15},"Buch.datum",{"$nulls":7},{"$f":"IF((Daten!$R$95+Daten!$R$98+Daten!$R$101+Daten!$R$104+Daten!$R$107+Daten!$R$110+Daten!$R$113)<0,TRUE,FALSE)","v":false}]
[null,"Mail",null,{"$f":"IF(Daten!$E$83=0,\"\",Daten!$E$83)","v":""},{"$nulls":8},"Ausgabe",null,null,"Einnahme",{"$nulls":3},"Buch.periode",{"$nulls":7},{"$f":"IF((Daten!$R$95+Daten!$R$98+Daten!$R$101+Daten!$R$104+Daten!$R$107+Daten!$R$110+Daten!$R$113)>=0,TRUE,FALSE)","v":true}]
[]
[null,3,"Bestellung über SRM / MM?",{"$nulls":8},"- Bitte unbedingt ankreuzen -",{"$nulls":6},"Eingangsstempel"]
{"$rows_left_out":46}
{"sheet":"Formular","index":3,"n_rows":85,"n_cols":67,"rows_kept":85,"hidden":true,"merged":[[2,6,2,8],[2,10,2,14],[2,16,2,20],[2,22,2,26],[2,28,2,32],[18,0,18,34],[18,55,18,70],[19,0,19,4],[19,5,19,9],[19,13,20,17],[19,19,19,34],[19,36,19,50],[19,55,19,70],[20,0,20,4],[20,5,20,9],[20,19,20,34],[20,36,20,50],[20,55,20,70],[21,0,21,4],[21,5,21,9],[21,13,21,17],[21,19,21,34],[21,36,21,50],[21,55,21,70],[22,0,22,4],[22,5,22,9],[22,19,22,34],[22,36,22,50],[22,55,22,70],[23,0,23,14],[23,19,23,34],[23,36,23,50],[23,55,23,70],[24,0,24,15],[24,19,24,34],[24,36,24,51],[24,55,24,70],[25,0,25,15],[25,19,25,34],[25,36,25,51],[25,55,25,70],[26,0,26,15],[26,19,26,34],[26,36,26,51],[26,55,26,70],[27,0,27,15],[27,19,27,34],[27,36,27,51],[27,55,27,70],[28,0,28,15],[28,19,28,34],[28,36,28,51],[28,55,28,70],[29,0,29,15],[29,19,29,34],[29,36,29,51],[29,55,29,70],[30,0,30,15],[30,19,30,34],[30,36,30,51],[30,55,30,70],[31,0,31,15],[31,19,31,34],[31,36,31,51],[31,55,31,70],[33,19,33,34],[33,55,33,70],[34,19,34,34],[34,55,34,70],[35,0,35,5],[35,6,35,14],[35,19,35,23],[35,25,35,32],[35,36,35,41],[35,42,35,50],[35,55,35,59],[35,61,35,68],[36,19,36,20],[36,22,36,29],[36,31,36,34],[36,55,36,70],[37,0,37,17],[37,19,37,20],[37,22,37,29],[37,31,37,34],[37,36,37,53],[37,55,37,70],[38,0,38,5],[38,19,38,20],[38,22,38,29],[38,31,38,34],[38,36,38,41],[38,55,38,70],[39,0,39,5],[39,19,39,20],[39,22,39,29],[39,31,39,34],[39,36,39,41],[39,55,39,56],[39,58,39,65],[39,67,39,70],[40,0,40,9],[40,10,40,17],[40,19,40,34],[40,46,40,53],[40,55,40,70],[41,0,41,7],[41,10,41,17],[41,36,41,43],[41,46,41,53],[42,0,43,9],[42,19,42,21],[42,22,42,25],[42,26,42,29],[42,30,42,34],[42,36,43,45],[42,55,42,57],[42,58,42,61],[42,62,42,65],[42,66,42,70],[43,19,43,21],[43,22,43,25],[43,26,43,29],[43,30,43,34],[43,55,43,57],[43,58,43,61],[43,62,43,65],[43,66,43,70],[45,1,45,33],[45,37,45,69],[46,1,46,33],[46,37,46,69],[47,1,47,33],[47,37,47,69],[49,2,49,18],[49,19,49,21],[49,22,49,25],[49,26,49,29],[49,30,49,34],[49,38,49,54],[49,55,49,57],[49,58,49,61],[49,62,49,65],[49,66,49,70],[50,2,50,5],[50,6,50,7],[50,9,50,13],[50,14,50,18],[50,22,50,25],[50,26,50,29],[50,30,50,34],[50,38,50,41],[50,42,50,43],[50,45,50,49],[50,50,50,54],[50,58,50,61],[50,62,50,65],[50,66,50,70],[52,2,52,18],[52,19,52,21],[52,22,52,25],[52,26,52,29],[52,30,52,34],[52,38,52,54],[52,55,52,57],[52,58,52,61],[52,62,52,65],[52,66,52,70],[53,2,53,5],[53,6,53,7],[53,9,53,13],[53,14,53,18],[53,30,53,34],[53,38,53,41],[53,42,53,43],[53,45,53,49],[53,50,53,54],[53,58,53,61],[53,62,53,65],[53,66,53,70],[55,2,55,18],[55,19,55,21],[55,22,55,25],[55,26,55,29],[55,30,55,34],[55,38,55,54],[55,55,55,57],[55,58,55,61],[55,62,55,65],[55,66,55,70],[56,2,56,5],[56,6,56,7],[56,9,56,13],[56,14,56,18],[56,30,56,34],[56,38,56,41],[56,42,56,43],[56,45,56,49],[56,50,56,54],[56,58,56,61],[56,62,56,65],[56,66,56,70],[58,2,58,18],[58,19,58,21],[58,22,58,25],[58,26,58,29],[58,30,58,34],[58,38,58,54],[58,55,58,57],[58,58,58,61],[58,62,58,65],[58,66,58,70],[59,2,59,5],[59,6,59,7],[59,9,59,13],[59,14,59,18],[59,30,59,34],[59,38,59,41],[59,42,59,43],[59,45,59,49],[59,50,59,54],[59,58,59,61],[59,62,59,65],[59,66,59,70],[61,2,61,18],[61,19,61,21],[61,22,61,25],[61,26,61,29],[61,30,61,34],[61,38,61,54],[61,55,61,57],[61,58,61,61],[61,62,61,65],[61,66,61,70],[62,2,62,5],[62,6,62,7],[62,9,62,13],[62,14,62,18],[62,30,62,34],[62,38,62,41],[62,42,62,43],[62,45,62,49],[62,50,62,54],[62,58,62,61],[62,62,62,65],[62,66,62,70],[64,2,64,18],[64,19,64,21],[64,22,64,25],[64,26,64,29],[64,30,64,34],[64,38,64,54],[64,55,64,57],[64,58,64,61],[64,62,64,65],[64,66,64,70],[65,2,65,5],[65,6,65,7],[65,9,65,13],[65,14,65,18],[65,30,65,34],[65,38,65,41],[65,42,65,43],[65,45,65,49],[65,50,65,54],[65,58,65,61],[65,62,65,65],[65,66,65,70],[67,2,67,18],[67,19,67,21],[67,22,67,25],[67,26,67,29],[67,30,67,34],[67,38,67,54],[67,55,67,57],[67,58,67,61],[67,62,67,65],[67,66,67,70],[68,2,68,5],[68,6,68,7],[68,9,68,13],[68,14,68,18],[68,30,68,34],[68,38,68,41],[68,42,68,43],[68,45,68,49],[68,50,68,54],[68,58,68,61],[68,62,68,65],[68,66,68,70],[71,0,71,10],[71,11,71,17],[71,30,71,34],[71,36,71,46],[71,47,71,53],[71,66,71,70],[74,0,74,2],[74,4,74,31],[74,32,74,34],[74,36,74,38],[74,40,74,67],[74,68,74,70],[75,9,76,21],[76,0,76,7],[76,23,76,34],[77,0,77,7],[77,23,77,34],[78,1,78,34],[78,37,78,70],[79,1,79,34],[79,37,79,70],[80,1,80,34],[80,37,80,70]]}
[]
[null,"Sprache",{"$nulls":4},"Fonds",{"$nulls":3},"Kostenstelle",{"$nulls":4},"/","Innenauftrag",{"$nulls":4},"/","PSP-Element",{"$nulls":5},"Rech.-Nr."]
[{"$nulls":10},{"$f":"IF(Daten!$V$16=2,3500520,IF($AJ$38=3,3500550,CHOOSE(Kontierung_Art,IF(OR(MID(Kontierung_Nr,1,1)=\"1\",MID(Kontierung_Nr,1,1)=\"2\"),IF(Daten!$V$69=TRUE,3500500,3500500),IF(Daten!$V$69=TRUE,3500510,3500510)),IF(Daten!$V$69=TRUE,3500510,3500510),IF(Daten!$V$69=TRUE,3500510,3500510))))","v":{"v":3500510,"d":"3 5 0 0 5 1 0"}},{"$nulls":24},{"$f":"IF(OR(Daten!$N$29=\"DE\",Daten!$N$29=\"AT\",Daten!$N$29=\"CH\"),1,2)","v":1}]
[]
[]
[null,"Privatperson oder Unternehmer ?",{"$nulls":14},"Lieferung oder Leistung ?",{"$nulls":11},"DE",null,"EU",null,"DL",null,null,{"$f":"IF(AC7=\"X\",AC6,IF(AE7=\"X\",AE6,IF(AG7=\"X\",AG6,\"\")))","v":"DE"}]
[{"$nulls":28},{"$f":"IF(Daten!$N$41=\"DE\",\"X\",\"\")","v":"X"},null,{"$f":"IF(OR(ISNA(VLOOKUP(Daten!$V$41,Länder!$A:$E,5,FALSE)),$AC$7=\"X\"),\"\",VLOOKUP(Daten!$V$41,Länder!$A:$E,5,FALSE))","v":""},null,{"$f":"IF(OR($AC$7=\"X\",$AE$7=\"X\"),\"\",\"X\")","v":""},null,null,{"$f":"IF(ISNA(VLOOKUP(Daten!$V$23,Rechtsformen!$A:$B,2,FALSE)),2,IF(VLOOKUP(Daten!$V$23,Rechtsformen!$A:$B,2,FALSE)=\"Privatperson\",1,2))","v":2}]
[{"$nulls":35},2]
{"$rows_left_out":78}
{"sheet":"Steuerkennzeichen","index":4,"n_rows":25,"n_cols":13,"rows_kept":25,"hidden":true}
[null,"steuerbar / \nnicht steuerbar",null,"Lieferung / \nLeistung",null,"Inland / \nEU-Ausland / \nDrittland",null,"Privatperson / \nUnternehmen",null,null,{"$f":"VLOOKUP(\"X\",$J$2:$L$25,2,FALSE)","v":"AN"},{"$f":"VLOOKUP(\"X\",$J$2:$L$25,3,FALSE)","v":1}]
[1,"nicht steuerbar",{"$f":"IF(CHOOSE(Kontierung_Art,IF(OR(MID(Kontierung_Nr,1,1)=\"1\",MID(Kontierung_Nr,1,2)=\"26\"),\"steuerbar\",\"nicht steuerbar\"),\"nicht steuerbar\",\"nicht steuerbar\")=B2,\"X\",\"-\")","v":"X"},"Lieferung",{"$f":"IF(CHOOSE(LoL,\"Lieferung\",\"Leistung\")=D2,\"X\",\"-\")","v":"-"},"DE",{"$f":"IF(Ort=F2,\"X\",\"-\")","v":"X"},"Privatperson",{"$f":"IF(CHOOSE(Rechtsform,\"Privatperson\",\"Unternehmen\")=H2,\"X\",\"-\")","v":"-"},{"$f":"IF(COUNTIF(B2:I2,\"X\")=4,\"X\",\"-\")","v":"-"},"AN",1]
[2,"nicht steuerbar","X","Lieferung","-","EU","-","Privatperson","-",{"$f":"IF(COUNTIF(B3:I3,\"X\")=4,\"X\",\"-\")","v":"-"},"AN",1]
[3,"nicht steuerbar","X","Lieferung","-","DL","-","Privatperson","-","-","AN",1]
[4,"nicht steuerbar","X","Lieferung","-","DE","X","Unternehmen","X","-","AN",1]
[5,"nicht steuerbar","X","Lieferung","-","EU","-","Unternehmen","X","-","AN",1]
[6,"nicht steuerbar","X","Lieferung","-","DL","-","Unternehmen","X","-","AN",1]
[7,"nicht steuerbar","X","Leistung","X","DE","X","Privatperson","-","-","AN",1]
{"$rows_left_out":18}
{"sheet":"Seite 2","index":5,"n_rows":5,"n_cols":38,"rows_kept":5,"hidden":true,"merged":[[0,0,0,34],[0,55,0,70],[2,1,2,33],[2,37,2,69],[4,1,4,33],[4,37,4,69]]}
["!!! Mehrfertigung für Abteilung Rechnungswesen !!!"]
[]
[null,{"$f":"\"Anlage \"&CHOOSE(Formular!$AJ$38,\"zur Rechnung \",\"zur Rechnung \",\"zur Pro Forma Rechnung \",\"zum Mittelabruf \",\"zum Bescheid \")&IF(Formular!$AJ$38=2,\"\",MID(YEAR(Formular!$G$36),3,2)&IF(LEN(Formular!$W$38)=7,\"000\",\"\")&Formular!$W$38&CHOOSE(LEN(Formular!$AF$38),\"000\",\"00\",\"0\",\"\")&Formular!$AF$38)","v":"Anlage zur Rechnung 2400035005100000"},{"$nulls":35},{"$f":"IF($B3=\"\",\"\",$B3)","v":"Anlage zur Rechnung 2400035005100000"}]
[]
[null,{"$f":"Daten!$E$118","v":0},{"$nulls":35},0]

{"sheet":"xRechnung","index":6,"n_rows":335,"n_cols":1,"rows_kept":335,"hidden":true}
["<?xml version=\"1.0\" encoding=\"UTF-8\"?>"]
["<Invoice xmlns=\"urn:oasis:names:specification:ubl:schema:xsd:Invoice-2\""]
["         xmlns:xades=\"http://uri.etsi.org/01903/v1.3.2#\""]
["         xmlns:ds=\"http://www.w3.org/2000/09/xmldsig#\""]
["         xmlns:cac=\"urn:oasis:names:specification:ubl:schema:xsd:CommonAggregateComponents-2\""]
["         xmlns:cbc=\"urn:oasis:names:specification:ubl:schema:xsd:CommonBasicComponents-2\""]
["         xmlns:ext=\"urn:oasis:names:specification:ubl:schema:xsd:CommonExtensionComponents-2\""]
["         xmlns:n0=\"urn:oasis:names:specification:ubl:schema:xsd:CommonSignatureComponents-2\""]
{"$rows_left_out":328}
{"sheet":"Rechtsformen","index":7,"n_rows":3,"n_cols":2,"rows_kept":3,"hidden":true}
[null,"Rechtsform"]
[1,"Privatperson"]
[2,"Unternehmen / Jurist. Person des Öffentl. Rechts"]

{"sheet":"Länder","index":8,"n_rows":263,"n_cols":6,"rows_kept":263,"hidden":true}
[null,"Land",null,"Länderkürzel","EU","Sprache"]
[1,"Afghanistan",null,"AF","","englisch"]
[2,"Ägypten",null,"EG","","englisch"]
[3,"Ålandinseln (FI)",null,"FI","","englisch"]
[4,"Albanien",null,"AL","","englisch"]
[5,"Algerien",null,"DZ","","englisch"]
[6,"Amerikanische Jungferninseln",null,"VI","","englisch"]
[7,"Andorra",null,"AD","","englisch"]
{"$rows_left_out":256}
{"sheet":"Kontierungsobjekte","index":9,"n_rows":4,"n_cols":2,"rows_kept":4,"hidden":true}
[null,"Kontierungsobjekte"]
[1,"PSP-Element"]
[2,"Kostenstelle und Fonds"]
[3,"Innenauftrag"]

{"sheet":"Maßeinheiten","index":10,"n_rows":20,"n_cols":5,"rows_kept":20,"hidden":true}
[null,"Maßeinheit","Kürzel \nSAP","Kürzel \neRechnung"]
[1,"Stück (ST)","ST","C62"]
[2,"Stunde (STD)","STD","HUR"]
[3,"Tag (TAG)","TAG","DAY"]
[4,"Monat (MON)","MON","3C"]
[5,"Jahr (JHR)","JHR","ANN"]
[6,"Kilowattstunde (KWH)","KWH","KWH"]
[7,"Gramm (G)","G","GRM"]
{"$rows_left_out":12}